Target
Nuclear receptor ROR-gamma
Ligand
BDBM332445
Substrate
Meas. Tech.
Biological Assays
IC50
4321±n/a nM
Citation
 Barr, KJBienstock, CEMaclean, JKZhang, HBeresis, RTZhang, DAnthony, NJLapointe, BTTian, Y 4-heteroaryl substituted benzoic acid compounds as RORgammaT inhibitors and uses thereof US Patent  US10196354 Publication Date 2/5/2019 
Target
Name:
Nuclear receptor ROR-gamma
Synonyms:
NR1F3 Nuclear receptor ROR-gamma (RORC) RAR-related orphan receptor C (RORc) RORG RZRG Retinoid-related orphan receptor-gamma (RORc)
Type:
Enzyme Catalytic Domain
Mol. Mass.:
58218.40
Organism:
Homo sapiens (Human)
Description:
P51449
Residue:
518
  
Inhibitor
Name:
BDBM332445
Synonyms:
4-(1-(2-chloro-6- (trifluoromethyl) benzoyl)-6- morpholino-1H- indazol-3-yl) benzoic acid US9745265, 4H
Type:
Small organic molecule
Emp. Form.:
C26H19ClF3N3O4
Mol. Mass.:
529.895
SMILES:
OC(=O)c1ccc(cc1)-c1nn(C(=O)c2c(Cl)cccc2C(F)(F)F)c2cc(ccc12)N1CCOCC1
: