Target
Nuclear receptor ROR-gamma
Ligand
BDBM332495
Substrate
Meas. Tech.
Biological Assays
IC50
>10000±n/a nM
Citation
 Barr, KJBienstock, CEMaclean, JKZhang, HBeresis, RTZhang, DAnthony, NJLapointe, BTTian, Y 4-heteroaryl substituted benzoic acid compounds as RORgammaT inhibitors and uses thereof US Patent  US10196354 Publication Date 2/5/2019 
Target
Name:
Nuclear receptor ROR-gamma
Synonyms:
NR1F3 Nuclear receptor ROR-gamma (RORC) RAR-related orphan receptor C (RORc) RORG RZRG Retinoid-related orphan receptor-gamma (RORc)
Type:
Enzyme Catalytic Domain
Mol. Mass.:
58218.40
Organism:
Homo sapiens (Human)
Description:
P51449
Residue:
518
  
Inhibitor
Name:
BDBM332495
Synonyms:
4-(1-(2-chloro-6-trifluoromethylbenzoyl)-6-(pyridin-3-yl)-1H-indazol-3-yl)benzoic acid (23A) US9745265, 23A
Type:
Small organic molecule
Emp. Form.:
C27H15ClF3N3O3
Mol. Mass.:
521.875
SMILES:
OC(=O)c1ccc(cc1)-c1nn(C(=O)c2c(Cl)cccc2C(F)(F)F)c2cc(ccc12)-c1cccnc1
: