Target
Tyrosine-protein phosphatase non-receptor type 1 [1-298]
Ligand
BDBM13465
Substrate
BDBM13466
Meas. Tech.
Phosphatase Inhibition Assay
pH
7±n/a
Temperature
295.15±n/a K
IC50
190±n/a nM
Citation
 Ala, PJGonneville, LHillman, MBecker-Pasha, MYue, EWDouty, BWayland, BPolam, PCrawley, MLMcLaughlin, ESparks, RBGlass, BTakvorian, ACombs, APBurn, TCHollis, GFWynn, R Structural insights into the design of nonpeptidic isothiazolidinone-containing inhibitors of protein-tyrosine phosphatase 1B. J Biol Chem 281:38013-21 (2006)  
Target
Name:
Tyrosine-protein phosphatase non-receptor type 1 [1-298]
Synonyms:
PTN1_HUMAN PTP1B PTPase 1B Tyrosine-protein phosphatase, non-receptor type 1
Type:
Enzyme
Mol. Mass.:
34670.65
Organism:
Homo sapiens (Human)
Description:
The catalytic domain of PTP 1B (residues 1-298) was expressed and purified from E. coli.
Residue:
298
  
Inhibitor
Name:
BDBM13465
Synonyms:
(2S)-N-[(1S)-1-carbamoyl-2-{4-[(5S)-1,1,3-trioxo-1,2-thiazolidin-5-yl]phenyl}ethyl]-2-acetamido-3-phenylpropanamide IZD 8 Saturated (S)-IZD
Type:
Small organic molecule
Emp. Form.:
C23H26N4O6S
Mol. Mass.:
486.541
SMILES:
CC(=O)N[C@@H](Cc1ccccc1)C(=O)N[C@@H](Cc1ccc(cc1)[C@@H]1CC(=O)NS1(=O)=O)C(N)=O
:
Substrate
Name:
BDBM13466
Synonyms:
4-Nitrophenyl phosphate disodium salt hexahydrate disodium (4-nitrophenyl) phosphate | para-nitrophenyl phosphate (pNPP)
Type:
Small organic molecule
Emp. Form.:
C6H4NO6P
Mol. Mass.:
217.0739
SMILES:
[O-][N+](=O)c1ccc(O[P+]([O-])([O-])[O-])cc1
: