Target
Tyrosine-protein phosphatase non-receptor type 1 [1-298]
Ligand
BDBM13469
Substrate
BDBM13466
Meas. Tech.
Phosphatase Inhibition Assay
pH
7±n/a
Temperature
295.15±n/a K
IC50
1.7±n/a nM
Citation
 Ala, PJGonneville, LHillman, MBecker-Pasha, MYue, EWDouty, BWayland, BPolam, PCrawley, MLMcLaughlin, ESparks, RBGlass, BTakvorian, ACombs, APBurn, TCHollis, GFWynn, R Structural insights into the design of nonpeptidic isothiazolidinone-containing inhibitors of protein-tyrosine phosphatase 1B. J Biol Chem 281:38013-21 (2006)  
Target
Name:
Tyrosine-protein phosphatase non-receptor type 1 [1-298]
Synonyms:
PTN1_HUMAN PTP1B PTPase 1B Tyrosine-protein phosphatase, non-receptor type 1
Type:
Enzyme
Mol. Mass.:
34670.65
Organism:
Homo sapiens (Human)
Description:
The catalytic domain of PTP 1B (residues 1-298) was expressed and purified from E. coli.
Residue:
298
  
Inhibitor
Name:
BDBM13469
Synonyms:
({4-[(2S)-2-carbamoyl-2-[(2S)-2-(1-{4-[difluoro(phosphono)methyl]phenyl}acetamido)-3-phenylpropanamido]ethyl]phenyl}difluoromethyl)phosphonic acid [[4-[[(1S)-1-[[(1S)-1-aminocarbonyl-2-[4-(difluoro-phosphono-methyl)phenyl]ethyl]carbamoyl]-2-phenyl-ethyl]carbamoylmethyl]phenyl]-difluoro-methyl]phosphonic acid
Type:
Small organic molecule
Emp. Form.:
C28H29F4N3O9P2
Mol. Mass.:
689.4857
SMILES:
NC(=O)[C@H](Cc1ccc(cc1)C(F)(F)P(O)(O)=O)NC(=O)[C@H](Cc1ccccc1)NC(=O)Cc1ccc(cc1)C(F)(F)P(O)(O)=O
:
Substrate
Name:
BDBM13466
Synonyms:
4-Nitrophenyl phosphate disodium salt hexahydrate disodium (4-nitrophenyl) phosphate | para-nitrophenyl phosphate (pNPP)
Type:
Small organic molecule
Emp. Form.:
C6H4NO6P
Mol. Mass.:
217.0739
SMILES:
[O-][N+](=O)c1ccc(O[P+]([O-])([O-])[O-])cc1
: