Target
Tyrosine-protein phosphatase non-receptor type 1 [1-298]
Ligand
BDBM13470
Substrate
BDBM13466
Meas. Tech.
Phosphatase Inhibition Assay
pH
7±n/a
Temperature
295.15±n/a K
IC50
46±n/a nM
Citation
 Ala, PJGonneville, LHillman, MBecker-Pasha, MYue, EWDouty, BWayland, BPolam, PCrawley, MLMcLaughlin, ESparks, RBGlass, BTakvorian, ACombs, APBurn, TCHollis, GFWynn, R Structural insights into the design of nonpeptidic isothiazolidinone-containing inhibitors of protein-tyrosine phosphatase 1B. J Biol Chem 281:38013-21 (2006)  
Target
Name:
Tyrosine-protein phosphatase non-receptor type 1 [1-298]
Synonyms:
PTN1_HUMAN PTP1B PTPase 1B Tyrosine-protein phosphatase, non-receptor type 1
Type:
Enzyme
Mol. Mass.:
34670.65
Organism:
Homo sapiens (Human)
Description:
The catalytic domain of PTP 1B (residues 1-298) was expressed and purified from E. coli.
Residue:
298
  
Inhibitor
Name:
BDBM13470
Synonyms:
Difluoromethylphosphonic acid (DFMP) deriv. 9 | [(4-{2-[(2S)-2-(1-{4-[difluoro(phosphono)methyl]phenyl}acetamido)-3-phenylpropanamido]ethyl}phenyl)difluoromethyl]phosphonic acid
Type:
Small organic molecule
Emp. Form.:
C27H28F4N2O8P2
Mol. Mass.:
646.461
SMILES:
OP(O)(=O)C(F)(F)c1ccc(CCNC(=O)[C@H](Cc2ccccc2)NC(=O)Cc2ccc(cc2)C(F)(F)P(O)(O)=O)cc1
:
Substrate
Name:
BDBM13466
Synonyms:
4-Nitrophenyl phosphate disodium salt hexahydrate disodium (4-nitrophenyl) phosphate | para-nitrophenyl phosphate (pNPP)
Type:
Small organic molecule
Emp. Form.:
C6H4NO6P
Mol. Mass.:
217.0739
SMILES:
[O-][N+](=O)c1ccc(O[P+]([O-])([O-])[O-])cc1
: