Target
Tyrosine-protein phosphatase non-receptor type 1 [1-298]
Ligand
BDBM13494
Substrate
BDBM13466
Meas. Tech.
Phosphatase Inhibition Assay
IC50
51±n/a nM
Citation
 Ala, PJGonneville, LHillman, MBecker-Pasha, MYue, EWDouty, BWayland, BPolam, PCrawley, MLMcLaughlin, ESparks, RBGlass, BTakvorian, ACombs, APBurn, TCHollis, GFWynn, R Structural insights into the design of nonpeptidic isothiazolidinone-containing inhibitors of protein-tyrosine phosphatase 1B. J Biol Chem 281:38013-21 (2006)  
Target
Name:
Tyrosine-protein phosphatase non-receptor type 1 [1-298]
Synonyms:
PTN1_HUMAN PTP1B PTPase 1B Tyrosine-protein phosphatase, non-receptor type 1
Type:
Enzyme
Mol. Mass.:
34670.65
Organism:
Homo sapiens (Human)
Description:
The catalytic domain of PTP 1B (residues 1-298) was expressed and purified from E. coli.
Residue:
298
  
Inhibitor
Name:
BDBM13494
Synonyms:
Isothiazolidinone (IZD) deriv. 30 | N-[(1S)-1-(1H-1,3-benzodiazol-2-yl)-2-[4-(1,1,3-trioxo-1,2-thiazolidin-5-yl)phenyl]ethyl]-3,5-dichlorobenzene-1-sulfonamide
Type:
Small organic molecule
Emp. Form.:
C24H20Cl2N4O5S2
Mol. Mass.:
579.475
SMILES:
Clc1cc(Cl)cc(c1)S(=O)(=O)N[C@@H](Cc1ccc(cc1)C1CC(=O)NS1(=O)=O)c1nc2ccccc2[nH]1
:
Substrate
Name:
BDBM13466
Synonyms:
4-Nitrophenyl phosphate disodium salt hexahydrate disodium (4-nitrophenyl) phosphate | para-nitrophenyl phosphate (pNPP)
Type:
Small organic molecule
Emp. Form.:
C6H4NO6P
Mol. Mass.:
217.0739
SMILES:
[O-][N+](=O)c1ccc(O[P+]([O-])([O-])[O-])cc1
: