Target
Tyrosine-protein phosphatase non-receptor type 1 [1-298]
Ligand
BDBM13499
Substrate
BDBM13466
Meas. Tech.
Phosphatase Inhibition Assay
IC50
110±n/a nM
Citation
 Ala, PJGonneville, LHillman, MBecker-Pasha, MYue, EWDouty, BWayland, BPolam, PCrawley, MLMcLaughlin, ESparks, RBGlass, BTakvorian, ACombs, APBurn, TCHollis, GFWynn, R Structural insights into the design of nonpeptidic isothiazolidinone-containing inhibitors of protein-tyrosine phosphatase 1B. J Biol Chem 281:38013-21 (2006)  
Target
Name:
Tyrosine-protein phosphatase non-receptor type 1 [1-298]
Synonyms:
PTN1_HUMAN PTP1B PTPase 1B Tyrosine-protein phosphatase, non-receptor type 1
Type:
Enzyme
Mol. Mass.:
34670.65
Organism:
Homo sapiens (Human)
Description:
The catalytic domain of PTP 1B (residues 1-298) was expressed and purified from E. coli.
Residue:
298
  
Inhibitor
Name:
BDBM13499
Synonyms:
Isothiazolidinone (IZD) deriv. 35 | N-[(1S)-1-(1H-1,3-benzodiazol-2-yl)-2-[4-(1,1,3-trioxo-1,2-thiazolidin-5-yl)phenyl]ethyl]-3-phenoxybenzene-1-sulfonamide
Type:
Small organic molecule
Emp. Form.:
C30H26N4O6S2
Mol. Mass.:
602.681
SMILES:
O=C1CC(c2ccc(C[C@H](NS(=O)(=O)c3cccc(Oc4ccccc4)c3)c3nc4ccccc4[nH]3)cc2)S(=O)(=O)N1
:
Substrate
Name:
BDBM13466
Synonyms:
4-Nitrophenyl phosphate disodium salt hexahydrate disodium (4-nitrophenyl) phosphate | para-nitrophenyl phosphate (pNPP)
Type:
Small organic molecule
Emp. Form.:
C6H4NO6P
Mol. Mass.:
217.0739
SMILES:
[O-][N+](=O)c1ccc(O[P+]([O-])([O-])[O-])cc1
: