Target
Cytochrome P450 11B1, mitochondrial
Ligand
BDBM336848
Substrate
Meas. Tech.
Inhibition Assay
IC50
18000±n/a nM
Citation
 Hornberger, KRMeyers, KMNemoto, PASurprenant, SYu, H Aldosterone synthase inhibitors US Patent  US9745289 Publication Date 8/29/2017 
Target
Name:
Cytochrome P450 11B1, mitochondrial
Synonyms:
C11B1_HUMAN CYPXIB1 Cytochrome P450 11B1 Cytochrome P450 11B1, mitochondrial | S11BH
Type:
Enzyme
Mol. Mass.:
57591.44
Organism:
Homo sapiens (Human)
Description:
P15538
Residue:
503
  
Inhibitor
Name:
BDBM336848
Synonyms:
US9745289, Compound 12A | US9745289, Compound 12B
Type:
Small organic molecule
Emp. Form.:
C21H23N3O5
Mol. Mass.:
397.4244
SMILES:
CC(=O)N1CCC(CC1)Oc1cncc(c1)C1COc2c(O1)cccc2C(N)=O
: