Target
Cytochrome P450 11B1, mitochondrial
Ligand
BDBM336870
Substrate
Meas. Tech.
Inhibition Assay
IC50
2000±n/a nM
Citation
 Hornberger, KRMeyers, KMNemoto, PASurprenant, SYu, H Aldosterone synthase inhibitors US Patent  US9745289 Publication Date 8/29/2017 
Target
Name:
Cytochrome P450 11B1, mitochondrial
Synonyms:
C11B1_HUMAN CYPXIB1 Cytochrome P450 11B1 Cytochrome P450 11B1, mitochondrial | S11BH
Type:
Enzyme
Mol. Mass.:
57591.44
Organism:
Homo sapiens (Human)
Description:
P15538
Residue:
503
  
Inhibitor
Name:
BDBM336870
Synonyms:
US9745289, Compound 23A | US9745289, Compound 23B
Type:
Small organic molecule
Emp. Form.:
C15H14N2O3
Mol. Mass.:
270.2833
SMILES:
Cc1ccncc1C1COc2c(O1)cccc2C(N)=O
: