Target
Metabotropic glutamate receptor 5
Ligand
BDBM292322
Substrate
Meas. Tech.
Calcium Influx Assay Based on Fluorescence
EC50
750±n/a nM
Citation
 Park, CEJang, YKShin, YJKim, JYHam, SMKim, YGMin, HKCha, SBJung, HJLee, JYHan, SNChung, JYChoi, EJJoung, CMPark, JSLee, JWCho, NRRyu, EJMaeng, CY Imidazopyrimidine and imidazotriazine derivative, and pharmaceutical composition comprising the same US Patent  US9745310 Publication Date 8/29/2017 
Target
Name:
Metabotropic glutamate receptor 5
Synonyms:
GPRC1E GRM5_HUMAN metabotropic glutamate 5 | metabotropic glutamate 5a
Type:
Enzyme
Mol. Mass.:
132484.72
Organism:
Homo sapiens (Human)
Description:
Residue:
1212
  
Inhibitor
Name:
BDBM292322
Synonyms:
US10100057, Example 177 US9745310, Example 177
Type:
Small organic molecule
Emp. Form.:
C19H14F2N4O2
Mol. Mass.:
368.3369
SMILES:
OCc1cc(F)ccc1-c1cnc2nc(COc3cncc(F)c3)cn2c1
: