Target
Tyrosine-protein phosphatase non-receptor type 1 [1-298]
Ligand
BDBM13816
Substrate
BDBM13594
Meas. Tech.
PTP1B and TCPTP Inhibition Assay
pH
6.3±n/a
Temperature
295.15±n/a K
IC50
163±37 nM
Km
20000±2000 nM
Comments
kcat/Km= 93000 M-1s-1
Citation
 Asante-Appiah, EPatel, SDesponts, CTaylor, JMLau, CDufresne, CTherien, MFriesen, RBecker, JWLeblanc, YKennedy, BPScapin, G Conformation-assisted inhibition of protein-tyrosine phosphatase-1B elicits inhibitor selectivity over T-cell protein-tyrosine phosphatase. J Biol Chem 281:8010-5 (2006)  
Target
Name:
Tyrosine-protein phosphatase non-receptor type 1 [1-298]
Synonyms:
PTN1_HUMAN PTP1B PTPase 1B Tyrosine-protein phosphatase, non-receptor type 1
Type:
Enzyme
Mol. Mass.:
34670.65
Organism:
Homo sapiens (Human)
Description:
The catalytic domain of PTP 1B (residues 1-298) was expressed and purified from E. coli.
Residue:
298
  
Inhibitor
Name:
BDBM13816
Synonyms:
[difluoro({4-[3-(4-fluorophenyl)-2-[4-(3-methyl-1,2,4-oxadiazol-5-yl)phenyl]-3-oxo-2-[(2E)-3-phenylprop-2-en-1-yl]propyl]phenyl})methyl]phosphonic acid | benzotriazole phenyldifluoromethylphosphonic acid compound 3
Type:
Small organic molecule
Emp. Form.:
C34H28F3N2O5P
Mol. Mass.:
632.5655
SMILES:
Cc1noc(n1)-c1ccc(cc1)C(C\C=C\c1ccccc1)(Cc1ccc(cc1)C(F)(F)P(O)(O)=O)C(=O)c1ccc(F)cc1
:
Substrate
Name:
BDBM13594
Synonyms:
Fluorescein diphosphate (FDP) fluorescein diphosphate, tetraammonium salt
Type:
Small organic molecule
Emp. Form.:
C20H10O11P2
Mol. Mass.:
488.2365
SMILES:
[O-]P([O-])(=O)Oc1ccc2c(Oc3cc(OP([O-])([O-])=O)ccc3C22OC(=O)c3ccccc23)c1
: