Target
Tyrosine-protein phosphatase non-receptor type 1 [L119V]
Ligand
BDBM13814
Substrate
BDBM13594
Meas. Tech.
PTP1B and TCPTP Inhibition Assay
pH
6.3±n/a
Temperature
295.15±n/a K
IC50
142±41 nM
Km
19000±2000 nM
Comments
kcat/Km= 71000 M-1s-1
Citation
 Asante-Appiah, EPatel, SDesponts, CTaylor, JMLau, CDufresne, CTherien, MFriesen, RBecker, JWLeblanc, YKennedy, BPScapin, G Conformation-assisted inhibition of protein-tyrosine phosphatase-1B elicits inhibitor selectivity over T-cell protein-tyrosine phosphatase. J Biol Chem 281:8010-5 (2006)  
Target
Name:
Tyrosine-protein phosphatase non-receptor type 1 [L119V]
Synonyms:
PTN1_HUMAN PTP1B PTPase 1B Tyrosine-protein phosphatase, non-receptor type 1
Type:
Enzyme
Mol. Mass.:
34656.62
Organism:
Homo sapiens (Human)
Description:
P18031[L119V] MDYKDDDDKLEF removed
Residue:
298
  
Inhibitor
Name:
BDBM13814
Synonyms:
({4-[(4E)-2-(1H-1,2,3-benzotriazol-1-yl)-2-[4-(methoxycarbonyl)phenyl]-5-phenylpent-4-en-1-yl]phenyl}difluoromethyl)phosphonic acid | benzotriazole phenyldifluoromethylphosphonic acid compound 1
Type:
Small organic molecule
Emp. Form.:
C32H28F2N3O5P
Mol. Mass.:
603.5524
SMILES:
COC(=O)c1ccc(cc1)C(C\C=C\c1ccccc1)(Cc1ccc(cc1)C(F)(F)P(O)(O)=O)n1nnc2ccccc12
:
Substrate
Name:
BDBM13594
Synonyms:
Fluorescein diphosphate (FDP) fluorescein diphosphate, tetraammonium salt
Type:
Small organic molecule
Emp. Form.:
C20H10O11P2
Mol. Mass.:
488.2365
SMILES:
[O-]P([O-])(=O)Oc1ccc2c(Oc3cc(OP([O-])([O-])=O)ccc3C22OC(=O)c3ccccc23)c1
: