Target
Tyrosine-protein kinase Lyn
Ligand
BDBM340125
Substrate
Meas. Tech.
Lyn Enzyme Activity
EC50
>1000±n/a nM
Citation
 Barf, TAJans, CGde Man, APOubrie, AARaaijmakers, HCRewinkel, JBSterrenburg, JGWijkmans, JC 4-imidazopyridazin-1-yl-benzamides as Btk inhibitors US Patent  US9758524 Publication Date 9/12/2017 
Target
Name:
Tyrosine-protein kinase Lyn
Synonyms:
JTK8 LYN_HUMAN Tyrosine-protein kinase Lyn (LYN) p53Lyn | p56Lyn
Type:
Protein
Mol. Mass.:
58575.92
Organism:
Homo sapiens (Human)
Description:
P07948
Residue:
512
  
Inhibitor
Name:
BDBM340125
Synonyms:
US10934296, Example 13 | US9758524, Example 13
Type:
Small organic molecule
Emp. Form.:
C25H22FN7O2
Mol. Mass.:
471.4863
SMILES:
Nc1nccn2c(nc(-c3ccc(C(=O)Nc4ccccn4)c(F)c3)c12)[C@@H]1CCCN1C(=O)C=C
: