Target
Epidermal growth factor receptor [1-249,301-1210,T790M,L858R]
Ligand
BDBM202380
Substrate
IC50
<1.000±n/a nM
Citation
 Lee, KNiu, DPetter, RCSingh, J Heteroaryl compounds and uses thereof US Patent  US9765038 Publication Date 9/19/2017 
Target
Name:
Epidermal growth factor receptor [1-249,301-1210,T790M,L858R]
Synonyms:
EGFR ERBB Epidermal growth factor receptor (T790M/L858R) | HER1
Type:
Receptor Kinase Domain
Mol. Mass.:
128584.06
Organism:
Homo sapiens (Human)
Description:
P00533[1-249,301-1210,T790M,L858R]
Residue:
1160
  
Inhibitor
Name:
BDBM202380
Synonyms:
US10081606, Compound I-12 US9765038, Compound I-12
Type:
Small organic molecule
Emp. Form.:
C20H17ClN4O3
Mol. Mass.:
396.827
SMILES:
COc1ccccc1Nc1ncc(Cl)c(Oc2cccc(NC(=O)C=C)c2)n1
: