Target
Tyrosine-protein phosphatase non-receptor type 1 [1-298]
Ligand
BDBM14268
Substrate
BDBM13466
Meas. Tech.
Phosphatase Inhibition Assay
pH
7±n/a
Temperature
295.15±n/a K
IC50
35±n/a nM
Citation
 Sparks, RBPolam, PZhu, WCrawley, MLTakvorian, AMcLaughlin, EWei, MAla, PJGonneville, LTaylor, NLi, YWynn, RBurn, TCLiu, PCCombs, AP Benzothiazole benzimidazole (S)-isothiazolidinone derivatives as protein tyrosine phosphatase-1B inhibitors. Bioorg Med Chem Lett 17:736-40 (2007)  
Target
Name:
Tyrosine-protein phosphatase non-receptor type 1 [1-298]
Synonyms:
PTN1_HUMAN PTP1B PTPase 1B Tyrosine-protein phosphatase, non-receptor type 1
Type:
Enzyme
Mol. Mass.:
34670.65
Organism:
Homo sapiens (Human)
Description:
The catalytic domain of PTP 1B (residues 1-298) was expressed and purified from E. coli.
Residue:
298
  
Inhibitor
Name:
BDBM14268
Synonyms:
(2S)-N-[(1S)-1-(1H-1,3-benzodiazol-2-yl)-2-{4-[(5S)-1,1,3-trioxo-1,2-thiazolidin-5-yl]phenyl}ethyl]-2-acetamido-3-phenylpropanamide CHEMBL211655 | IZD deriv. 1
Type:
Small organic molecule
Emp. Form.:
C29H29N5O5S
Mol. Mass.:
559.636
SMILES:
CC(=O)N[C@@H](Cc1ccccc1)C(=O)N[C@@H](Cc1ccc(cc1)[C@@H]1CC(=O)NS1(=O)=O)c1nc2ccccc2[nH]1
:
Substrate
Name:
BDBM13466
Synonyms:
4-Nitrophenyl phosphate disodium salt hexahydrate disodium (4-nitrophenyl) phosphate | para-nitrophenyl phosphate (pNPP)
Type:
Small organic molecule
Emp. Form.:
C6H4NO6P
Mol. Mass.:
217.0739
SMILES:
[O-][N+](=O)c1ccc(O[P+]([O-])([O-])[O-])cc1
: