Target
Coagulation factor XI
Ligand
BDBM341292
Substrate
Meas. Tech.
Biochemical Assay
IC50
0.500±n/a nM
Citation
 Röhrig, SHillisch, AStrassburger, JHeitmeier, SSchmidt, MVSchlemmer, KTersteegen, ABuchmüller, AGerdes, CSchäfer, MTeller, HJimenez Nunez, ESchirok, HKlar, J Substituted oxopyridine derivatives US Patent  US9765070 Publication Date 9/19/2017 
Target
Name:
Coagulation factor XI
Synonyms:
Coagulation factor XIa Coagulation factor XIa light chain FA11_HUMAN Factor XIa PTA | Plasma thromboplastin antecedent
Type:
Enzyme
Mol. Mass.:
70130.58
Organism:
Homo sapiens (Human)
Description:
P03951
Residue:
625
  
Inhibitor
Name:
BDBM341292
Synonyms:
6-({2-[4-(5-Chloro-2-cyanophenyl)-5-methoxy-2-oxopyridin-1(2H)-yl]-3-[(2S)-tetrahydro-2H-pyran-2-yl]propanoyl}amino)imidazo[1,2-a]pyridine-2-carboxylic acid (mixture of enantiomerically pure diastereomers) | US9765070, Example 9
Type:
Small organic molecule
Emp. Form.:
C29H26ClN5O6
Mol. Mass.:
576
SMILES:
COc1cn(C(C[C@@H]2CCCCO2)C(=O)Nc2ccc3nc(cn3c2)C(O)=O)c(=O)cc1-c1cc(Cl)ccc1C#N
: