Target
Fibroblast growth factor receptor 3
Ligand
BDBM340013
Substrate
Meas. Tech.
Inhibition Kinases In Vitro Assay
IC50
25.3±n/a nM
Citation
 Zdzalik, DLipner, JWieczorek, MDzwonek, KYamani, ADubiel, KLamparska-Przybysz, MGrygielewicz, PStanczak, A Pyrazolylbenzo[d]imidazole derivatives US Patent  US9776988 Publication Date 10/3/2017 
Target
Name:
Fibroblast growth factor receptor 3
Synonyms:
CD_antigen: CD333 FGFR3 Fibroblast growth factor receptor JTK4
Type:
Protein
Mol. Mass.:
87699.57
Organism:
Homo sapiens (Human)
Description:
P22607
Residue:
806
  
Inhibitor
Name:
BDBM340013
Synonyms:
US9776988, Example 2
Type:
Small organic molecule
Emp. Form.:
C25H27N5O4
Mol. Mass.:
461.513
SMILES:
COc1cc(CCc2cc(n[nH]2)-c2nc3cc(ccc3[nH]2)C(=O)N2CCOCC2)cc(OC)c1
: