Target
Fibroblast growth factor receptor 1
Ligand
BDBM340025
Substrate
Meas. Tech.
Inhibition Kinases In Vitro Assay
IC50
9.65±n/a nM
Citation
 Zdzalik, DLipner, JWieczorek, MDzwonek, KYamani, ADubiel, KLamparska-Przybysz, MGrygielewicz, PStanczak, A Pyrazolylbenzo[d]imidazole derivatives US Patent  US9776988 Publication Date 10/3/2017 
Target
Name:
Fibroblast growth factor receptor 1
Synonyms:
BFGFR Basic fibroblast growth factor receptor 1 (FGFR1) CEK FGFR-1 FGFR-1, (FL) FGFR1_HUMAN FLT2 Fibroblast growth factor receptor 1 (FGFR-1) Fms-like tyrosine kinase 2 N-sam bFGF-R | c-fgr
Type:
Receptor
Mol. Mass.:
91861.70
Organism:
Homo sapiens (Human)
Description:
P11362
Residue:
822
  
Inhibitor
Name:
BDBM340025
Synonyms:
US9776988, Example 8
Type:
Small organic molecule
Emp. Form.:
C26H30N6O3
Mol. Mass.:
474.5548
SMILES:
COc1cc(CCc2cc(n[nH]2)-c2nc3cc(ccc3[nH]2)C(=O)N2CCN(C)CC2)cc(OC)c1
: