Target
Fibroblast growth factor receptor 3
Ligand
BDBM342456
Substrate
Meas. Tech.
Inhibition Kinases In Vitro Assay
IC50
33.1±n/a nM
Citation
 Zdzalik, DLipner, JWieczorek, MDzwonek, KYamani, ADubiel, KLamparska-Przybysz, MGrygielewicz, PStanczak, A Pyrazolylbenzo[d]imidazole derivatives US Patent  US9776988 Publication Date 10/3/2017 
Target
Name:
Fibroblast growth factor receptor 3
Synonyms:
CD_antigen: CD333 FGFR3 Fibroblast growth factor receptor JTK4
Type:
Protein
Mol. Mass.:
87699.57
Organism:
Homo sapiens (Human)
Description:
P22607
Residue:
806
  
Inhibitor
Name:
BDBM342456
Synonyms:
US9776988, Example 14
Type:
Small organic molecule
Emp. Form.:
C31H41N7O3
Mol. Mass.:
559.7023
SMILES:
COc1cc(CCc2cc(n[nH]2)-c2nc3cc(CN4CCN(CCN5CCOCC5)CC4)ccc3[nH]2)cc(OC)c1
: