Target
Fibroblast growth factor receptor 1
Ligand
BDBM342463
Substrate
Meas. Tech.
Inhibition Kinases In Vitro Assay
IC50
6.54±n/a nM
Citation
 Zdzalik, DLipner, JWieczorek, MDzwonek, KYamani, ADubiel, KLamparska-Przybysz, MGrygielewicz, PStanczak, A Pyrazolylbenzo[d]imidazole derivatives US Patent  US9776988 Publication Date 10/3/2017 
Target
Name:
Fibroblast growth factor receptor 1
Synonyms:
BFGFR Basic fibroblast growth factor receptor 1 (FGFR1) CEK FGFR-1 FGFR-1, (FL) FGFR1_HUMAN FLT2 Fibroblast growth factor receptor 1 (FGFR-1) Fms-like tyrosine kinase 2 N-sam bFGF-R | c-fgr
Type:
Receptor
Mol. Mass.:
91861.70
Organism:
Homo sapiens (Human)
Description:
P11362
Residue:
822
  
Inhibitor
Name:
BDBM342463
Synonyms:
US9776988, Example 27
Type:
Small organic molecule
Emp. Form.:
C29H33N7O3
Mol. Mass.:
527.6174
SMILES:
COc1cc(CCc2cc(n[nH]2)-c2nc3ccc(cc3[nH]2)-c2ccn(CCN3CCOCC3)n2)cc(OC)c1
: