Target
Fibroblast growth factor receptor 3
Ligand
BDBM342463
Substrate
Meas. Tech.
Inhibition Kinases In Vitro Assay
IC50
17.8±n/a nM
Citation
 Zdzalik, DLipner, JWieczorek, MDzwonek, KYamani, ADubiel, KLamparska-Przybysz, MGrygielewicz, PStanczak, A Pyrazolylbenzo[d]imidazole derivatives US Patent  US9776988 Publication Date 10/3/2017 
Target
Name:
Fibroblast growth factor receptor 3
Synonyms:
CD_antigen: CD333 FGFR3 Fibroblast growth factor receptor JTK4
Type:
Protein
Mol. Mass.:
87699.57
Organism:
Homo sapiens (Human)
Description:
P22607
Residue:
806
  
Inhibitor
Name:
BDBM342463
Synonyms:
US9776988, Example 27
Type:
Small organic molecule
Emp. Form.:
C29H33N7O3
Mol. Mass.:
527.6174
SMILES:
COc1cc(CCc2cc(n[nH]2)-c2nc3ccc(cc3[nH]2)-c2ccn(CCN3CCOCC3)n2)cc(OC)c1
: