Target
Vascular endothelial growth factor receptor 2
Ligand
BDBM342463
Substrate
Meas. Tech.
Inhibition Kinases In Vitro Assay
IC50
88.1±n/a nM
Citation
 Zdzalik, DLipner, JWieczorek, MDzwonek, KYamani, ADubiel, KLamparska-Przybysz, MGrygielewicz, PStanczak, A Pyrazolylbenzo[d]imidazole derivatives US Patent  US9776988 Publication Date 10/3/2017 
Target
Name:
Vascular endothelial growth factor receptor 2
Synonyms:
CD_antigen=CD309 Fetal liver kinase 1 (FLK-1) KDR Protein-tyrosine kinase receptor Flk-1 VEGFR-2 VEGFR2 Vascular Endothelial Growth Factor Receptor Kinase 2 Vascular endothelial growth factor receptor 2 (KDR) Vascular endothelial growth factor receptor 2 (VEGFR2) Vascular endothelial growth factor receptor-2 (VEGFR-2)
Type:
Receptor Tyrosine Kinase
Mol. Mass.:
151510.97
Organism:
Homo sapiens (Human)
Description:
P35968
Residue:
1356
  
Inhibitor
Name:
BDBM342463
Synonyms:
US9776988, Example 27
Type:
Small organic molecule
Emp. Form.:
C29H33N7O3
Mol. Mass.:
527.6174
SMILES:
COc1cc(CCc2cc(n[nH]2)-c2nc3ccc(cc3[nH]2)-c2ccn(CCN3CCOCC3)n2)cc(OC)c1
: