Target
Fibroblast growth factor receptor 2
Ligand
BDBM342472
Substrate
Meas. Tech.
Inhibition Kinases In Vitro Assay
IC50
2.18±n/a nM
Citation
 Zdzalik, DLipner, JWieczorek, MDzwonek, KYamani, ADubiel, KLamparska-Przybysz, MGrygielewicz, PStanczak, A Pyrazolylbenzo[d]imidazole derivatives US Patent  US9776988 Publication Date 10/3/2017 
Target
Name:
Fibroblast growth factor receptor 2
Synonyms:
BEK FGFR-2 FGFR2 Fibroblast growth factor receptor 2 (FGFR2) KGFR Keratinocyte growth factor receptor VEGF-receptor 2 and Fibroblast growth factor receptor 2
Type:
Enzyme
Mol. Mass.:
92015.45
Organism:
Homo sapiens (Human)
Description:
P21802
Residue:
821
  
Inhibitor
Name:
BDBM342472
Synonyms:
US9776988, Example 4
Type:
Small organic molecule
Emp. Form.:
C27H32N6O4
Mol. Mass.:
504.5808
SMILES:
COc1cc(CCc2cc(n[nH]2)-c2nc3ccc(cc3[nH]2)C(=O)NCCN2CCOCC2)cc(OC)c1
: