Target
Tyrosine-protein kinase JAK1 [850-1154]
Ligand
BDBM349059
Substrate
Meas. Tech.
JAK1 Inhibition Assay
IC50
<100±n/a nM
Citation
 Menet, CJVan Rompaey, LJFletcher, SRBlanc, JJouannigot, NHodges, AJSmits, KK Compounds useful for the treatment of degenerative and inflammatory diseases US Patent  US10206907 Publication Date 2/19/2019 
Target
Name:
Tyrosine-protein kinase JAK1 [850-1154]
Synonyms:
JAK1 JAK1A JAK1_HUMAN
Type:
Enzyme Catalytic Domain
Mol. Mass.:
34949.64
Organism:
Homo sapiens (Human)
Description:
P23458[850-1154]
Residue:
305
  
Inhibitor
Name:
BDBM349059
Synonyms:
1-cyano-N-(4-(2- (cyclopropanecarboxamido)- [1,2,4]triazolo[1,5-a]pyridin-5- yl)phenyl)cyclopropanecarbox- amide | US10206907, Compound 177
Type:
Small organic molecule
Emp. Form.:
C21H18N6O2
Mol. Mass.:
386.4066
SMILES:
O=C(Nc1nc2cccc(-c3ccc(NC(=O)C4(CC4)C#N)cc3)n2n1)C1CC1
: