Target
Tyrosine-protein kinase JAK2 [808-1132]
Ligand
BDBM349109
Substrate
Meas. Tech.
JAK2 Inhibition Assay
IC50
<100±n/a nM
Citation
 Menet, CJVan Rompaey, LJFletcher, SRBlanc, JJouannigot, NHodges, AJSmits, KK Compounds useful for the treatment of degenerative and inflammatory diseases US Patent  US10206907 Publication Date 2/19/2019 
Target
Name:
Tyrosine-protein kinase JAK2 [808-1132]
Synonyms:
JAK2 JAK2_HUMAN | Tyrosine-protein kinase JAK2 JH1 (808-1132)
Type:
Protein
Mol. Mass.:
39171.39
Organism:
Homo sapiens (Human)
Description:
O60674[808-1132]
Residue:
335
  
Inhibitor
Name:
BDBM349109
Synonyms:
3-{4-[2- (Cyclopropanecarbonyl- amino)-[1,2,4]triazolo[1,5- a]pyridin-5-yl]-benzylamino}- benzamide | US10206907, Compound 228
Type:
Small organic molecule
Emp. Form.:
C24H22N6O2
Mol. Mass.:
426.4705
SMILES:
NC(=O)c1cccc(NCc2ccc(cc2)-c2cccc3nc(NC(=O)C4CC4)nn23)c1
: