Target
Tyrosine-protein kinase JAK2 [808-1132]
Ligand
BDBM349162
Substrate
Meas. Tech.
JAK2 Inhibition Assay
IC50
<100±n/a nM
Citation
 Menet, CJVan Rompaey, LJFletcher, SRBlanc, JJouannigot, NHodges, AJSmits, KK Compounds useful for the treatment of degenerative and inflammatory diseases US Patent  US10206907 Publication Date 2/19/2019 
Target
Name:
Tyrosine-protein kinase JAK2 [808-1132]
Synonyms:
JAK2 JAK2_HUMAN | Tyrosine-protein kinase JAK2 JH1 (808-1132)
Type:
Protein
Mol. Mass.:
39171.39
Organism:
Homo sapiens (Human)
Description:
O60674[808-1132]
Residue:
335
  
Inhibitor
Name:
BDBM349162
Synonyms:
Cyclopropanecarboxylic acid (5-{4-[acetyl-(6-cyano- pyridin-3-ylmethyl)-amino]- phenyl}-[1,2,4]triazolo[1,5- a]pyridin-2-yl)-amide | US10206907, Compound 297
Type:
Small organic molecule
Emp. Form.:
C25H21N7O2
Mol. Mass.:
451.4799
SMILES:
CC(=O)N(Cc1ccc(nc1)C#N)c1ccc(cc1)-c1cccc2nc(NC(=O)C3CC3)nn12
: