Target
Tyrosine-protein kinase JAK3 [781-1124]
Ligand
BDBM348981
Substrate
Meas. Tech.
JAK3 Inhibition Assay
IC50
<100±n/a nM
Citation
 Menet, CJVan Rompaey, LJFletcher, SRBlanc, JJouannigot, NHodges, AJSmits, KK Compounds useful for the treatment of degenerative and inflammatory diseases US Patent  US10206907 Publication Date 2/19/2019 
Target
Name:
Tyrosine-protein kinase JAK3 [781-1124]
Synonyms:
JAK3 JAK3_HUMAN Tyrosine-protein kinase JAK3 Tyrosine-protein kinase JAK3 (aa 781-1124)
Type:
Mol. Mass.:
38772.27
Organism:
Homo sapiens (Human)
Description:
P52333[781-1124]
Residue:
344
  
Inhibitor
Name:
BDBM348981
Synonyms:
N-(5-(4-((1,2,4-oxadiazol-3- yl)methoxy)phenyl)- [1,2,4]triazolo[1,5-a]pyridin-2- yl)cyclopropanecarboxamide | US10206907, Compound 99
Type:
Small organic molecule
Emp. Form.:
C19H16N6O3
Mol. Mass.:
376.3687
SMILES:
O=C(Nc1nc2cccc(-c3ccc(OCc4ncon4)cc3)n2n1)C1CC1
: