Target
Tyrosine-protein kinase JAK3 [781-1124]
Ligand
BDBM349038
Substrate
Meas. Tech.
JAK3 Inhibition Assay
IC50
<100±n/a nM
Citation
 Menet, CJVan Rompaey, LJFletcher, SRBlanc, JJouannigot, NHodges, AJSmits, KK Compounds useful for the treatment of degenerative and inflammatory diseases US Patent  US10206907 Publication Date 2/19/2019 
Target
Name:
Tyrosine-protein kinase JAK3 [781-1124]
Synonyms:
JAK3 JAK3_HUMAN Tyrosine-protein kinase JAK3 Tyrosine-protein kinase JAK3 (aa 781-1124)
Type:
Mol. Mass.:
38772.27
Organism:
Homo sapiens (Human)
Description:
P52333[781-1124]
Residue:
344
  
Inhibitor
Name:
BDBM349038
Synonyms:
N-(5-(4-(4-benzyl-4- hydroxypiperidine-1- carbonyl)phenyl)- [1,2,4]triazolo[1,5-a]pyridin-2- yl)cyclopropanecarboxamide | US10206907, Compound 156
Type:
Small organic molecule
Emp. Form.:
C29H29N5O3
Mol. Mass.:
495.5723
SMILES:
OC1(Cc2ccccc2)CCN(CC1)C(=O)c1ccc(cc1)-c1cccc2nc(NC(=O)C3CC3)nn12
: