Target
Transcription initiation factor TFIID subunit 1 [1381-1497]
Ligand
BDBM346544
Substrate
Meas. Tech.
TAF1-BD1 TR-FRET Binding Assay
IC50
96.8±n/a nM
Citation
 Adler, MBurdick, DJCrawford, TDuplessis, MMagnuson, SRNasveschuk, CGRomero, FATang, YTsui, VHWang, S Therapeutic compounds and uses thereof US Patent  US10202378 Publication Date 2/12/2019 
Target
Name:
Transcription initiation factor TFIID subunit 1 [1381-1497]
Synonyms:
BA2R CCGS TAF1-BD1 TAF1_HUMAN | TAF2A
Type:
Enzyme Catalytic Domain
Mol. Mass.:
25344.81
Organism:
Homo sapiens (human)
Description:
P21675[1381-1497]
Residue:
217
  
Inhibitor
Name:
BDBM346544
Synonyms:
US10202378, Example 148 | cyclopentylmethyl 4-(3-hydroxy-3-methyl-but-1-ynyl)-2,6-dimethyl-7-oxo-1H-pyrrolo[2,3-c]pyridine-3-carboxylate
Type:
Small organic molecule
Emp. Form.:
C21H26N2O4
Mol. Mass.:
370.4421
SMILES:
Cc1[nH]c2c(c1C(=O)OCC1CCCC1)c(cn(C)c2=O)C#CC(C)(C)O
: