Target
High affinity cGMP-specific 3',5'-cyclic phosphodiesterase 9A
Ligand
BDBM247176
Substrate
Meas. Tech.
PDE9 Inhibition Assay
pH
7.6±n/a
Temperature
298.15±n/a K
IC50
67±n/a nM
Comments
extracted
Citation
 Svenstrup, NSimonsen, KBRasmussen, LKJuhl, KLanggård, MWen, KWang, Y PDE9 inhibitors with imidazo triazinone backbone US Patent  US9533992 Publication Date 1/3/2017 
Target
Name:
High affinity cGMP-specific 3',5'-cyclic phosphodiesterase 9A
Synonyms:
3',5'-cyclic phosphodiesterase PDE9A_HUMAN Phosphodiesterase 9A (PDE9) | Phosphodiesterase 9A (PDE9A)
Type:
Protein
Mol. Mass.:
68488.40
Organism:
Homo sapiens (Human)
Description:
O76083
Residue:
593
  
Inhibitor
Name:
BDBM247176
Synonyms:
US9434733, 2-[1-[(6-methoxy-3-pyridyl)methyl]-4-methyl-pyrrolidin-3-yl]-7-tetrahydropyran-4-yl-3H-imidazo[5,1-f][1,2,4]triazin-4-one | US9533992, 2-[1-[(6-methoxy-3-pyridyl)methyl]-4-methyl-pyrrolidin-3-yl]-7-tetrahydropyran-4-yl-3H-imidazo[5,1-f][1,2,4]triazin-4-one
Type:
Small organic molecule
Emp. Form.:
C22H28N6O3
Mol. Mass.:
424.4961
SMILES:
COc1ccc(CN2CC(C)C(C2)c2nn3c(ncc3c(=O)[nH]2)C2CCOCC2)cn1
: