Target
High affinity cGMP-specific 3',5'-cyclic phosphodiesterase 9A
Ligand
BDBM247235
Substrate
Meas. Tech.
PDE9 Inhibition Assay
pH
7.6±n/a
Temperature
298.15±n/a K
IC50
110±0 nM
Comments
extracted
Citation
 Svenstrup, NSimonsen, KBRasmussen, LKJuhl, KLanggård, MWen, KWang, Y PDE9 inhibitors with imidazo triazinone backbone US Patent  US9533992 Publication Date 1/3/2017 
Target
Name:
High affinity cGMP-specific 3',5'-cyclic phosphodiesterase 9A
Synonyms:
3',5'-cyclic phosphodiesterase PDE9A_HUMAN Phosphodiesterase 9A (PDE9) | Phosphodiesterase 9A (PDE9A)
Type:
Protein
Mol. Mass.:
68488.40
Organism:
Homo sapiens (Human)
Description:
O76083
Residue:
593
  
Inhibitor
Name:
BDBM247235
Synonyms:
2-[1-[3-(4-pyrrolidin-1-ylphenyl)azetidin-1-yl]ethyl]-7-tetrahydropyran-4-yl-3H-imidazo[5,1-f][1,2,4]triazin-4-one US9533992, 2-[1-[3-(4-pyrrolidin-1-ylphenyl)azetidin-1-yl]ethyl]-7-tetrahydropyran-4-yl-3H-imidazo[5,1-f][1,2,4]triazin-4-one
Type:
Small organic molecule
Emp. Form.:
C25H32N6O2
Mol. Mass.:
448.5606
SMILES:
CC(N1CC(C1)c1ccc(cc1)N1CCCC1)c1nn2c(ncc2c(=O)[nH]1)C1CCOCC1
: