Target
RAC-alpha serine/threonine-protein kinase [139-480,S378A,S381A,T450D,S473D]
Ligand
BDBM15131
Substrate
biotinylated Akt peptide substrate
Meas. Tech.
Akt Kinase Assay
pH
7.5±n/a
Temperature
295.15±n/a K
IC50
0.16±n/a nM
Citation
 Zhu, GDGandhi, VBGong, JThomas, SWoods, KWSong, XLi, TDiebold, RBLuo, YLiu, XGuan, RKlinghofer, VJohnson, EFBouska, JOlson, AMarsh, KCStoll, VSMamo, MPolakowski, JCampbell, TJMartin, RLGintant, GAPenning, TDLi, QRosenberg, SHGiranda, VL Syntheses of potent, selective, and orally bioavailable indazole-pyridine series of protein kinase b/akt inhibitors with reduced hypotension. J Med Chem 50:2990-3003 (2007)  
Target
Name:
RAC-alpha serine/threonine-protein kinase [139-480,S378A,S381A,T450D,S473D]
Synonyms:
AKT1 C-AKT Protein kinase B (Akt 1) RAC | RAC-PK-alpha
Type:
Enzyme
Mol. Mass.:
39513.28
Organism:
Homo sapiens (Human)
Description:
Recombinant His-tagged Akt1 (S378A, S381A, T450D, S473D; 139-480)
Residue:
342
  
Inhibitor
Name:
BDBM15131
Synonyms:
5-indazolyl pyridine 3 A-443654 | indazole-pyridine, 4
Type:
Small organic molecule
Emp. Form.:
C24H23N5O
Mol. Mass.:
397.4723
SMILES:
Cc1n[nH]c2ccc(cc12)-c1cncc(OC[C@@H](N)Cc2c[nH]c3ccccc23)c1
:
Substrate
Name:
biotinylated Akt peptide substrate
Synonyms:
Type:
Biotinylated Peptide
Mol. Mass.:
3178.04
Organism:
Description:
Km=15 uM
Residue:
28