Target
RAC-alpha serine/threonine-protein kinase [139-480,S378A,S381A,T450D,S473D]
Ligand
BDBM16587
Substrate
biotinylated Akt peptide substrate
Meas. Tech.
Akt Kinase Assay
IC50
0.6±n/a nM
Citation
 Zhu, GDGandhi, VBGong, JThomas, SWoods, KWSong, XLi, TDiebold, RBLuo, YLiu, XGuan, RKlinghofer, VJohnson, EFBouska, JOlson, AMarsh, KCStoll, VSMamo, MPolakowski, JCampbell, TJMartin, RLGintant, GAPenning, TDLi, QRosenberg, SHGiranda, VL Syntheses of potent, selective, and orally bioavailable indazole-pyridine series of protein kinase b/akt inhibitors with reduced hypotension. J Med Chem 50:2990-3003 (2007)  
Target
Name:
RAC-alpha serine/threonine-protein kinase [139-480,S378A,S381A,T450D,S473D]
Synonyms:
AKT1 C-AKT Protein kinase B (Akt 1) RAC | RAC-PK-alpha
Type:
Enzyme
Mol. Mass.:
39513.28
Organism:
Homo sapiens (Human)
Description:
Recombinant His-tagged Akt1 (S378A, S381A, T450D, S473D; 139-480)
Residue:
342
  
Inhibitor
Name:
BDBM16587
Synonyms:
(2S)-1-{[5-(3-methyl-1H-pyrazolo[3,4-c]pyridin-5-yl)pyridin-3-yl]oxy}-3-[3-(trifluoromethyl)phenyl]propan-2-amine pyrazolopyridine-pyridine, 37c
Type:
Small organic molecule
Emp. Form.:
C22H20F3N5O
Mol. Mass.:
427.4223
SMILES:
Cc1n[nH]c2cnc(cc12)-c1cncc(OC[C@@H](N)Cc2cccc(c2)C(F)(F)F)c1
:
Substrate
Name:
biotinylated Akt peptide substrate
Synonyms:
Type:
Biotinylated Peptide
Mol. Mass.:
3178.04
Organism:
Description:
Km=15 uM
Residue:
28