Target
Nuclear receptor ROR-gamma
Ligand
BDBM352590
Substrate
Meas. Tech.
Biological Assay
IC50
3.13±n/a nM
Citation
 Aicher, TDVanHuis, CAThomas, WDMacLean, JKAndresen, BMBarr, KJBienstock, CEAnthony, NJDaniels, MLiu, KLiu, YWhite, CMLapointe, BTSciammetta, NSimov, V Tetrahydronaphthyridine, benzoxazine, aza-benzoxazine and related bicyclic compounds for inhibition of RORgamma activity and the treatment of disease US Patent  US9809561 Publication Date 11/7/2017 
Target
Name:
Nuclear receptor ROR-gamma
Synonyms:
NR1F3 Nuclear receptor ROR-gamma (RORC) RAR-related orphan receptor C (RORc) RORG RZRG Retinoid-related orphan receptor-gamma (RORc)
Type:
Enzyme Catalytic Domain
Mol. Mass.:
58218.40
Organism:
Homo sapiens (Human)
Description:
P51449
Residue:
518
  
Inhibitor
Name:
BDBM352590
Synonyms:
(S)-methyl 2-(6-((tert- butoxycarbonyl)amino)-4-((4-fluoro-3- (trifluoromethyl)phenyl)sulfonyl)-3,4- dihydro-2H-benzo[b][1,4]oxazin-2- yl)acetate US9809561, 30B
Type:
Small organic molecule
Emp. Form.:
C23H24F4N2O7S
Mol. Mass.:
548.504
SMILES:
COC(=O)C[C@H]1CN(c2cc(NC(=O)OC(C)(C)C)ccc2O1)S(=O)(=O)c1ccc(F)c(c1)C(F)(F)F
: