Target
Nuclear receptor ROR-gamma
Ligand
BDBM352746
Substrate
Meas. Tech.
Biological Assay
IC50
3.49±n/a nM
Citation
 Aicher, TDVanHuis, CAThomas, WDMacLean, JKAndresen, BMBarr, KJBienstock, CEAnthony, NJDaniels, MLiu, KLiu, YWhite, CMLapointe, BTSciammetta, NSimov, V Tetrahydronaphthyridine, benzoxazine, aza-benzoxazine and related bicyclic compounds for inhibition of RORgamma activity and the treatment of disease US Patent  US9809561 Publication Date 11/7/2017 
Target
Name:
Nuclear receptor ROR-gamma
Synonyms:
NR1F3 Nuclear receptor ROR-gamma (RORC) RAR-related orphan receptor C (RORc) RORG RZRG Retinoid-related orphan receptor-gamma (RORc)
Type:
Enzyme Catalytic Domain
Mol. Mass.:
58218.40
Organism:
Homo sapiens (Human)
Description:
P51449
Residue:
518
  
Inhibitor
Name:
BDBM352746
Synonyms:
(S)-tert-butyl (2-(2-acetamido-2-methylpropyl)-4-((3-chloro-4-fluorophenyl) sulfonyl)-3,4-dihydro-2H-benzo[b][1,4]oxazin-6-yl)carbamate US9809561, 54
Type:
Small organic molecule
Emp. Form.:
C25H31ClFN3O6S
Mol. Mass.:
556.047
SMILES:
CC(=O)NC(C)(C)C[C@H]1CN(c2cc(NC(=O)OC(C)(C)C)ccc2O1)S(=O)(=O)c1ccc(F)c(Cl)c1
: