Target
Prothrombin
Ligand
BDBM17243
Substrate
BDBM12680
Meas. Tech.
Enzyme Inhibition Assay
Ki
510±n/a nM
Citation
 Kochanny, MJAdler, MEwing, JGriedel, BDHo, EKaranjawala, RLee, WLentz, DLiang, AMMorrissey, MMPhillips, GBPost, JSacchi, KLSakata, STSubramanyam, BVergona, RWalters, JWhite, KAWhitlow, MYe, BZhao, ZShaw, KJ Substituted thiophene-anthranilamides as potent inhibitors of human factor Xa. Bioorg Med Chem 15:2127-46 (2007)  
Target
Name:
Prothrombin
Synonyms:
Activation peptide fragment 1 Coagulation factor II Prothrombin precursor Thrombin heavy chain | Thrombin light chain
Type:
Protein
Mol. Mass.:
70029.57
Organism:
Homo sapiens (Human)
Description:
P00734
Residue:
622
  
Inhibitor
Name:
BDBM17243
Synonyms:
3-chloro-N-{4-chloro-2-[(4-chlorophenyl)carbamoyl]phenyl}-5-(1H-imidazol-1-ylmethyl)thiophene-2-carboxamide | thiophene-containing non-amidine inhibitor, 36
Type:
Small organic molecule
Emp. Form.:
C22H15Cl3N4O2S
Mol. Mass.:
505.804
SMILES:
Clc1cc(Cn2ccnc2)sc1C(=O)Nc1ccc(Cl)cc1C(=O)Nc1ccc(Cl)cc1
:
Substrate
Name:
BDBM12680
Synonyms:
(2S)-N-[(2S)-5-carbamimidamido-2-[(4-nitrophenyl)amino]pentanoyl]-3-phenyl-2-[(2R)-pyrrolidin-2-ylformamido]propanamide H-D-Pro-Phe-Arg-p-nitroanilide | prolyl-phenylalanyl-arginine-p-nitroanilide
Type:
Small organic molecule
Emp. Form.:
C26H34N8O5
Mol. Mass.:
538.5988
SMILES:
N\C([NH-])=[NH+]/CCCC(NC(=O)C(Cc1ccccc1)NC(=O)C1CCCN1)C(=O)Nc1ccc(cc1)[N+]([O-])=O
: