Target
Dipeptidyl peptidase 9
Ligand
BDBM11144
Substrate
BDBM11057
Meas. Tech.
Dipeptidyl Peptidase Inhibition Assay
IC50
>100000±n/a nM
Citation
 Duffy, JLKirk, BAWang, LEiermann, GJHe, HLeiting, BLyons, KAPatel, RAPatel, SBPetrov, AScapin, GWu, JKThornberry, NAWeber, AE 4-aminophenylalanine and 4-aminocyclohexylalanine derivatives as potent, selective, and orally bioavailable inhibitors of dipeptidyl peptidase IV. Bioorg Med Chem Lett 17:2879-85 (2007)  
Target
Name:
Dipeptidyl peptidase 9
Synonyms:
DPP9 DPRP-2 Dipeptidyl peptidase 9 (DDP9) Dipeptidyl peptidase 9 (DPP9) Dipeptidyl peptidase IX Dipeptidyl peptidase-like protein 9
Type:
Enzyme
Mol. Mass.:
98260.70
Organism:
Homo sapiens (Human)
Description:
Q86TI2
Residue:
863
  
Inhibitor
Name:
BDBM11144
Synonyms:
(1S,2S)-1-(dimethylcarbamoyl)-3-[(3S)-3-fluoropyrrolidin-1-yl]-3-oxo-1-(4-{[1,2,4]triazolo[1,5-a]pyridin-6-yl}phenyl)propan-2-aminium; 2,2,2-trifluoroacetate Biarylphenylalanine (S)-Fluoropyrrolidide Amide 23 | phenylalanine derived inhibitor, 5
Type:
Small organic molecule
Emp. Form.:
C22H26FN6O2
Mol. Mass.:
425.4787
SMILES:
CN(C)C(=O)[C@H]([C@H]([NH3+])C(=O)N1CC[C@H](F)C1)c1ccc(cc1)-c1ccc2ncnn2c1
:
Substrate
Name:
BDBM11057
Synonyms:
1-(2-aminoacetyl)-N-(4-methyl-2-oxo-2H-chromen-7-yl)pyrrolidine-2-carboxamide hydrobromide Gly-Pro-7-amidomethylcoumarin | Gly-Pro-AMC
Type:
Small organic molecule
Emp. Form.:
C17H19N3O4
Mol. Mass.:
329.3505
SMILES:
Cc1cc(=O)oc2cc(NC(=O)C3CCCN3C(=O)CN)ccc12
: