Target
Genome polyprotein
Ligand
BDBM17891
Substrate
NS3-NS4A Chromogenic Peptide Substrate
Meas. Tech.
Continuous Spectrophotometric Assay
Ki
1000±n/a nM
Citation
 Prongay, AJGuo, ZYao, NPichardo, JFischmann, TStrickland, CMyers, JWeber, PCBeyer, BMIngram, RHong, ZProsise, WWRamanathan, LTaremi, SSYarosh-Tomaine, TZhang, RSenior, MYang, RSMalcolm, BArasappan, ABennett, FBogen, SLChen, KJao, ELiu, YTLovey, RGSaksena, AKVenkatraman, SGirijavallabhan, VNjoroge, FGMadison, V Discovery of the HCV NS3/4A protease inhibitor (1R,5S)-N-[3-amino-1-(cyclobutylmethyl)-2,3-dioxopropyl]-3- [2(S)-[[[(1,1-dimethylethyl)amino]carbonyl]amino]-3,3-dimethyl-1-oxobutyl]- 6,6-dimethyl-3-azabicyclo[3.1.0]hexan-2(S)-carboxamide (Sch 503034) II. Key steps in structure-based optimization. J Med Chem 50:2310-8 (2007)  
Target
Name:
Genome polyprotein
Synonyms:
Dipeptidyl peptidase 4 (DPP4) NS3 NS5B NS3-4A Protease NS3/4A protease POLG_HCV77 | RNA polymerase (NS5B)
Type:
Protease Domain
Mol. Mass.:
327221.49
Organism:
Hepatitis C virus (HCV genotype 1a, isolate H)
Description:
P27958
Residue:
3011
  
Inhibitor
Name:
BDBM17891
Synonyms:
2-{2-[(tert-butylcarbamoyl)amino]-3,3-dimethylbutanamido}-N-(1-carbamoyl-3-cyclobutyl-1-oxopropan-2-yl)-4-methylpentanamide | Ketoamide inhibitor, 27
Type:
Small organic molecule
Emp. Form.:
C25H45N5O5
Mol. Mass.:
495.6553
SMILES:
CC(C)CC(NC(=O)C(NC(=O)NC(C)(C)C)C(C)(C)C)C(=O)NC(CC1CCC1)C(=O)C(N)=O
:
Substrate
Name:
NS3-NS4A Chromogenic Peptide Substrate
Synonyms:
Type:
Peptide
Mol. Mass.:
1366.94
Organism:
Description:
The 4-phenylazophenol (PAP) chromophore was incorporated to improve assay sensitivity.
Residue:
13
ACDTEDVVPNVAH