Target
Envelope glycoprotein gp160
Ligand
BDBM359473
Substrate
Meas. Tech.
Biological Methods
EC50
2430±n/a nM
Citation
 Bender, JAGentles, RGPendri, AWang, AXMeanwell, NABeno, BRFridell, RABelema, MNguyen, VNYang, ZWang, GKumaravel, SThangathirupathy, SBora, ROHolehatti, SMMettu, MRPanda, M Inhibitors of human immunodeficiency virus replication US Patent  US10221129 Publication Date 3/5/2019 
Target
Name:
Envelope glycoprotein gp160
Synonyms:
Env polyprotein | NL4-3
Type:
Enzyme Catalytic Domain
Mol. Mass.:
97031.14
Organism:
Human immunodeficiency virus type 1 (isolate BRU/LAI group M subtypeB) (HIV-1)
Description:
Residue:
854
  
Inhibitor
Name:
BDBM359473
Synonyms:
US10221129, Example BB-29
Type:
Small organic molecule
Emp. Form.:
C28H27F2N7O5S2
Mol. Mass.:
643.685
SMILES:
CN(C)C(=O)C1Cc2cccnc2N1S(=O)(=O)NC(=O)N[C@H](Cc1cc(F)cc(F)c1)C(=O)N(C)c1ccc2scnc2c1
: