Target
Envelope glycoprotein gp160
Ligand
BDBM359482
Substrate
Meas. Tech.
Biological Methods
EC50
160±n/a nM
Citation
 Bender, JAGentles, RGPendri, AWang, AXMeanwell, NABeno, BRFridell, RABelema, MNguyen, VNYang, ZWang, GKumaravel, SThangathirupathy, SBora, ROHolehatti, SMMettu, MRPanda, M Inhibitors of human immunodeficiency virus replication US Patent  US10221129 Publication Date 3/5/2019 
Target
Name:
Envelope glycoprotein gp160
Synonyms:
Env polyprotein | NL4-3
Type:
Enzyme Catalytic Domain
Mol. Mass.:
97031.14
Organism:
Human immunodeficiency virus type 1 (isolate BRU/LAI group M subtypeB) (HIV-1)
Description:
Residue:
854
  
Inhibitor
Name:
BDBM359482
Synonyms:
US10221129, Example BB-36
Type:
Small organic molecule
Emp. Form.:
C22H26F4N4O5S
Mol. Mass.:
534.524
SMILES:
CCN(CC)S(=O)(=O)NC(=O)N[C@@H](Cc1cc(F)cc(F)c1)C(=O)N(C)c1ccc(OC(F)F)cc1
: