Target
Apelin receptor
Ligand
BDBM269518
Substrate
Meas. Tech.
[35S]GTPgammaS Binding Assay
EC50
0.540±n/a nM
Target
Name:
Apelin receptor
Synonyms:
AGTRL1 APJ_HUMAN Angiotensin receptor-like 1 Apelin receptor (APJ) G-protein coupled receptor HG11
Type:
Enzyme Catalytic Domain
Mol. Mass.:
42664.06
Organism:
Homo sapiens (Human)
Description:
P35414
Residue:
380
  
Inhibitor
Name:
BDBM269518
Synonyms:
(1R,2S)-N-(4-(4,6-dimethoxy-5-pyrimidinyl)-5-(6-methoxy-2-pyridinyl)-4H-1,2,4-triazol-3-yl)-1-methoxy-1-(5-methyl-2-pyrimidinyl)-2-propanesulfonamide US10221162, Example 35.0 | US9845310, Example 35.0
Type:
Small organic molecule
Emp. Form.:
C23H27N9O6S
Mol. Mass.:
557.582
SMILES:
CO[C@@H]([C@H](C)S(=O)(=O)Nc1nnc(-c2cccc(OC)n2)n1-c1c(OC)ncnc1OC)c1ncc(C)cn1
: