Target
Metallo-beta-lactamase type 2
Ligand
BDBM360916
Substrate
Meas. Tech.
BIOLOGICAL ASSAYS
IC50
0.020±n/a nM
Citation
 Bennett, FJiang, JPasternak, ADong, SGu, XScott, JDTang, HZhao, ZHuang, YYang, DYoung, KXiao, LZhang, ZFu, J Metallo-beta-lactamase inhibitors US Patent  US10221163 Publication Date 3/5/2019 
Target
Name:
Metallo-beta-lactamase type 2
Synonyms:
B2 metallo-beta-lactamase Beta-lactamase NDM-1 Metallo-beta-lactamase NDM-1 Metallo-beta-lactamase type II New Delhi metallo-beta-lactamase-1 | blaNDM-1
Type:
PROTEIN
Mol. Mass.:
28498.15
Organism:
Klebsiella pneumoniae
Description:
ChEMBL_103887
Residue:
270
  
Inhibitor
Name:
BDBM360916
Synonyms:
(S)-tert-butyl 3-(2-(N,N-bis(4- methoxybenzyl)sulfamoyl)-4- iodo-3-(2-(4-methoxybenzyl)- 2H-tetrazol-5- yl)phenylsulfonamido)pyrrolidine- 1-carboxylate | US10221163, Example 72
Type:
Small organic molecule
Emp. Form.:
C40H46IN7O9S2
Mol. Mass.:
959.869
SMILES:
COc1ccc(CN(Cc2ccc(OC)cc2)S(=O)(=O)c2c(ccc(I)c2-c2nnn(Cc3ccc(OC)cc3)n2)S(=O)(=O)N[C@H]2CCN(C2)C(=O)OC(C)(C)C)cc1
: