Target
VIM-1 metallo-beta-lactamase
Ligand
BDBM360961
Substrate
Meas. Tech.
BIOLOGICAL ASSAYS
IC50
0.183±n/a nM
Citation
 Bennett, FJiang, JPasternak, ADong, SGu, XScott, JDTang, HZhao, ZHuang, YYang, DYoung, KXiao, LZhang, ZFu, J Metallo-beta-lactamase inhibitors US Patent  US10221163 Publication Date 3/5/2019 
Target
Name:
VIM-1 metallo-beta-lactamase
Synonyms:
Beta-lactamase VIM-1 VIM-1 metallo-beta-lactamase | blaVIM-1
Type:
undefined
Mol. Mass.:
28014.53
Organism:
Klebsiella pneumoniae
Description:
Q5GN09
Residue:
266
  
Inhibitor
Name:
BDBM360961
Synonyms:
2-(4-(2- aminobenzo[d] thiazol-4-yl)-2- sulfamoyl-3-(1H- tetrazol-5-yl)phenyl- sulfonamido)-2- methylpropan-1- aminium formate US10544130, Example 117
Type:
Small organic molecule
Emp. Form.:
C18H21N9O4S3
Mol. Mass.:
523.612
SMILES:
CC(C)(CN)NS(=O)(=O)c1ccc(-c2cccc3sc(N)nc23)c(-c2nnn[nH]2)c1S(N)(=O)=O
: