Target
Neuromedin-K receptor
Ligand
BDBM362841
Substrate
Meas. Tech.
Binding Competition Assay
IC50
20.0±n/a nM
Citation
 Hoveyda, HDutheuil, GFraser, G N-acyl-(3-substituted)-(8-methyl)-5,6-dihydro-[1,2,4]triazolo[4,3-a] pyrazines as selective NK-3 receptor antagonists, pharmaceutical composition, methods for use in NK-3 receptor-mediated disorders US Patent  US9840508 Publication Date 12/12/2017 
Target
Name:
Neuromedin-K receptor
Synonyms:
NK-3 receptor NK3R NKR Neurokinin B receptor Neuromedin-3 receptor (NK-3R) Neuromedin-K receptor Neuromedin-K receptor (NK3) TAC3R Tachykinin receptor 3 | Tachykinin receptor 3 (NK3)
Type:
Enzyme
Mol. Mass.:
52221.96
Organism:
Homo sapiens (Human)
Description:
P29371
Residue:
465
  
Inhibitor
Name:
BDBM362841
Synonyms:
(R)-(4-fluorophenyl)(8- methyl-3-(2- (trifluoromethyl)thiazol-4-yl)- 5,6-dihydro- [1,2,4]triazolo[4,3-a]pyrazin- 7(8H)-yl)methanone | US9840508, Compound 3
Type:
Small organic molecule
Emp. Form.:
C17H13F4N5OS
Mol. Mass.:
411.377
SMILES:
C[C@H]1N(CCn2c1nnc2-c1csc(n1)C(F)(F)F)C(=O)c1ccc(F)cc1
: