Target
Lysine-specific histone demethylase 1A
Ligand
BDBM243404
Substrate
Meas. Tech.
LSD1 Inhibitory Activity
pH
8±n/a
Temperature
298.15±n/a K
IC50
<100.0±n/a nM
Comments
extracted
Citation
 Matsumoto, SHattori, YToyofuku, MMorimoto, SDaini, MKojima, TKaku, TIto, M Cyclopropanamine compound and use thereof US Patent  US10053456 Publication Date 8/21/2018 
Target
Name:
Lysine-specific histone demethylase 1A
Synonyms:
AOF2 Flavin-containing amine oxidase domain-containing protein 2 KDM1A KIAA0601 Lysine-specific demethylase 1 (LSD1) Lysine-specific histone demethylase 1 (LSD1)
Type:
Enzyme
Mol. Mass.:
92901.01
Organism:
Homo sapiens (Human)
Description:
O60341
Residue:
852
  
Inhibitor
Name:
BDBM243404
Synonyms:
N-cyclopentyl-5- ((1R,2R)-2- (tetrahydro-2H- pyran-4-ylamino)- cyclopropyl)thio- phene-3-carboxamide US10053456, 39 US10968213, Example 39 US9920047, 39
Type:
Small organic molecule
Emp. Form.:
C18H26N2O2S
Mol. Mass.:
334.476
SMILES:
O=C(NC1CCCC1)c1csc(c1)C1CC1NC1CCOCC1
: