Target
Amine oxidase [flavin-containing] B
Ligand
BDBM256707
Substrate
Meas. Tech.
MAO-B Inhibitory Activity
pH
7.5±n/a
Temperature
298.15±n/a K
IC50
>100000±n/a nM
Comments
extracted
Citation
 Matsumoto, SHattori, YToyofuku, MMorimoto, SDaini, MKojima, TKaku, TIto, M Cyclopropanamine compound and use thereof US Patent  US10053456 Publication Date 8/21/2018 
Target
Name:
Amine oxidase [flavin-containing] B
Synonyms:
AOFB_HUMAN MAOB Monoamine oxidase type B (MAO B) Monoamine oxidase type B (MAOB)
Type:
Protein
Mol. Mass.:
58768.76
Organism:
Homo sapiens (Human)
Description:
P27338
Residue:
520
  
Inhibitor
Name:
BDBM256707
Synonyms:
US10053456, 89 US9487511, 89 US9920047, 89
Type:
Small organic molecule
Emp. Form.:
C16H20N4OS
Mol. Mass.:
316.421
SMILES:
Cn1cc(NC(=O)c2cc(cs2)[C@@H]2C[C@H]2NC2CCC2)cn1
: