Target
Apelin receptor
Ligand
BDBM269691
Substrate
Meas. Tech.
[35S]GTPγS Binding
EC50
1.30±n/a nM
Citation
 Chen, NChen, XCheng, ACConnors, RVDeignan, JDransfield, PJDu, XFu, ZHeath, JAHorne, DBHouze, JKaller, MRKopecky, DJLai, SMa, ZMcGee, LRMedina, JCMihalic, JTNishimura, NOlson, SHPattaropong, VWang, XYang, KDebenedetto, MVHedley, SJ Intermediates for preparing triazole agonists of the APJ receptor US Patent  US9845310 Publication Date 12/19/2017 
Target
Name:
Apelin receptor
Synonyms:
AGTRL1 APJ_HUMAN Angiotensin receptor-like 1 Apelin receptor (APJ) G-protein coupled receptor HG11
Type:
Enzyme Catalytic Domain
Mol. Mass.:
42664.06
Organism:
Homo sapiens (Human)
Description:
P35414
Residue:
380
  
Inhibitor
Name:
BDBM269691
Synonyms:
(2S)—N-(4-(2,6-dimethoxyphenyl)-5-(3-pyridinyl)-4H-1,2,4-triazol-3-yl)-1-(5-fluoro-2-pyrimidinyl)-2-propanesulfonamide or (2R)—N-(4-(2,6-dimethoxyphenyl)-5-(3-pyridinyl)-4H-1,2,4-triazol-3-yl)-1-(5-fluoro-2-pyrimidinyl)-2-propanesulfonamide US10058550, Example 205.1 US9845310, Example 206.0
Type:
Small organic molecule
Emp. Form.:
C22H22FN7O4S
Mol. Mass.:
499.518
SMILES:
COc1cccc(OC)c1-n1c(NS(=O)(=O)[C@H](C)Cc2ncc(F)cn2)nnc1-c1cccnc1
: