Target
Apelin receptor
Ligand
BDBM269974
Substrate
Meas. Tech.
[35S]GTPγS Binding
EC50
0.930±n/a nM
Citation
 Chen, NChen, XCheng, ACConnors, RVDeignan, JDransfield, PJDu, XFu, ZHeath, JAHorne, DBHouze, JKaller, MRKopecky, DJLai, SMa, ZMcGee, LRMedina, JCMihalic, JTNishimura, NOlson, SHPattaropong, VWang, XYang, KDebenedetto, MVHedley, SJ Intermediates for preparing triazole agonists of the APJ receptor US Patent  US9845310 Publication Date 12/19/2017 
Target
Name:
Apelin receptor
Synonyms:
AGTRL1 APJ_HUMAN Angiotensin receptor-like 1 Apelin receptor (APJ) G-protein coupled receptor HG11
Type:
Enzyme Catalytic Domain
Mol. Mass.:
42664.06
Organism:
Homo sapiens (Human)
Description:
P35414
Residue:
380
  
Inhibitor
Name:
BDBM269974
Synonyms:
1S,2S)—N-(4-(2,6-dimethoxyphenyl)-5-(6-methoxy-2-pyridinyl)-4H-1,2,4-triazol-3-yl)-1-hydroxy-1-(3-methoxy-5-methyl-2-pyrazinyl)-2-propanesulfonamide or (1R,2R)—N-(4-(2,6-dimethoxyphenyl)-5-(6-methoxy-2-pyridinyl)-4H-1,2,4-triazol-3-yl)-1-hydroxy-1-(3-methoxy-5-methyl-2-pyrazinyl)-2-propanesulfonamide US10058550, Example 512.0 US9845310, Example 512.0
Type:
Small organic molecule
Emp. Form.:
C25H29N7O7S
Mol. Mass.:
571.605
SMILES:
COc1cccc(n1)-c1nnc(NS(=O)(=O)[C@H](C)[C@H](O)c2ncc(C)nc2OC)n1-c1c(OC)cccc1OC
: