Target
ALK tyrosine kinase receptor
Ligand
BDBM243401
Substrate
Meas. Tech.
Inhibitory Activity Against Anaplastic Lymphoma Kinase (ALK)
Temperature
298.15±n/a K
IC50
1.000±n/a nM
Comments
extracted
Citation
 Yun, CSKim, HRCho, SYJung, HJLee, KChae, CHLee, COPark, CHKim, PHwang, JYHa, JDAhn, SJ Pyrimidine-2,4-diamine derivative and anticancer pharmaceutical composition comprising same as effective ingredient US Patent  US10053458 Publication Date 8/21/2018 
Target
Name:
ALK tyrosine kinase receptor
Synonyms:
ALK ALK_HUMAN CD_antigen: CD246
Type:
Protein
Mol. Mass.:
176453.10
Organism:
Homo sapiens (Human)
Description:
Q9UM73
Residue:
1620
  
Inhibitor
Name:
BDBM243401
Synonyms:
5-chloro-N4-(2-(isopropylsulfonyl)phenyl)-N2-(7-methoxy-1,1-dimethyl-1,2,3,4-tetrahydroisoquinolin-6-yl)pyrimidine-2,4-diamine US10053458, 33
Type:
Small organic molecule
Emp. Form.:
C25H30ClN5O3S
Mol. Mass.:
516.055
SMILES:
COc1cc2c(CCNC2(C)C)cc1Nc1ncc(Cl)c(Nc2ccccc2S(=O)(=O)C(C)C)n1
: