Target
Tyrosine-protein kinase Lck
Ligand
BDBM340069
Substrate
Meas. Tech.
Lck Enzyme Activity
EC50
>1000±n/a nM
Citation
 Barf, TAJans, CGde Man, APOubrie, AARaaijmakers, HCRewinkel, JBSterrenburg, JGWijkmans, JC 4-imidazopyridazin-1-yl-benzamides as BTK inhibitors US Patent  US10239883 Publication Date 3/26/2019 
Target
Name:
Tyrosine-protein kinase Lck
Synonyms:
2.7.10.2 LCK_HUMAN Leukocyte C-terminal Src kinase Lymphocyte-specific protein tyrosine kinase Protein YT16 Proto-oncogene tyrosine-protein kinase LCK T cell-specific protein-tyrosine kinase
Type:
Mol. Mass.:
57987.83
Organism:
Homo sapiens (Human)
Description:
P06239
Residue:
509
  
Inhibitor
Name:
BDBM340069
Synonyms:
(S,E)-4-(8-amino-3-(1-(4- methoxybut-2-enoyl)piperidin-2- yl)imidazo[1,5-a]pyrazin-1-yl)-N- (pyridazin-3-yl)benzamide US10934296, Example 72 | US9758524, Example 72
Type:
Small organic molecule
Emp. Form.:
C27H28N8O3
Mol. Mass.:
512.563
SMILES:
COC\C=C\C(=O)N1CCCC[C@H]1c1nc(-c2ccc(cc2)C(=O)Nc2cccnn2)c2c(N)nccn12
: